BDBM50373105 CHEMBL259441
SMILES O=C(Cc1ccc(cc1)-c1ccccc1)N[C@H]1CCOC1=O
InChI Key InChIKey=NRIAMXCZWQOQQD-INIZCTEOSA-N
Data  3 IC50
  Tab Delimited (TSV)   2D SDfile   Computed 3D by Vconf -m prep SDfile
Find this compound or compounds like it in BindingDB:
Activity Spreadsheet -- Enzyme Inhibition Constant Data from BindingDB
Found 3 hits for monomerid = 50373105
TargetQuorum-sensing transcriptional repressor QscR(Pseudomonas aeruginosa)
University Of Wisconsin-Madison
Curated by ChEMBL
LigandPNGBDBM50373105(CHEMBL259441)
Affinity DataIC50:  30nM. Assay description: Antagonist activity at Pseudomonas aeruginosa QscR expressed in Escherichia coli assessed as inhibition of dodecanoyl homoserine lactone induced prod...
In DepthDetails ArticlePubMed
TargetTranscriptional activator protein LuxR(Vibrio fischeri (strain ATCC 700601 / ES114))TBA
LigandPNGBDBM50373105(CHEMBL259441)
Affinity DataIC50:  600nM. Assay description: Antagonist activity against LuxR mediated quorum sensing system in Vibrio fischeri ES114 expressing luxI assessed as decrease in luminescence intensi...
In DepthDetails PubMed
TargetTranscriptional activator protein LuxR(Vibrio fischeri)
Larkin University
Curated by ChEMBL
LigandPNGBDBM50373105(CHEMBL259441)
Affinity DataIC50:  1.10E+3nM. Assay description: Antagonist activity at Aliivibrio fischeri ES114 LuxR after 4 to 8 hrs by luminescence method
In DepthDetails ArticlePubMed