BDBM50375454 CHEMBL261045
SMILES CCc1nn(C[C@H](C)N)c2c1ccc1occc21
InChI Key InChIKey=YUUIXXWVRJNQQP-VIFPVBQESA-N
Data  2 KI
  Tab Delimited (TSV)   2D SDfile   Computed 3D by Vconf -m prep SDfile
Find this compound or compounds like it in BindingDB:
Activity Spreadsheet -- Enzyme Inhibition Constant Data from BindingDB
Found 2 hits for monomerid = 50375454
Target5-hydroxytryptamine receptor 2C(Homo sapiens (Human))
Astellas Pharma
Curated by ChEMBL
LigandPNGBDBM50375454(CHEMBL261045)
Affinity DataKi:  2.5nM. Assay description: Displacement of [3H]5-HT from human 5HT2C receptor expressed in CHO cells
In DepthDetails ArticlePubMed
Target5-hydroxytryptamine receptor 2A(Homo sapiens (Human))
Astellas Pharma
Curated by ChEMBL
LigandPNGBDBM50375454(CHEMBL261045)
Affinity DataKi:  11nM. Assay description: Displacement of [3H]5-HT from human 5HT2A receptor expressed in CHO cells
In DepthDetails ArticlePubMed