BDBM50377455 CHEMBL264698
SMILES FC(F)(F)c1nc(C(=O)c2ccccn2)c2sccc2n1
InChI Key InChIKey=LRPPAXIITWFHKU-UHFFFAOYSA-N
Data  2 KI
  Tab Delimited (TSV)   2D SDfile   Computed 3D by Vconf -m prep SDfile
Find this compound or compounds like it in BindingDB:
Activity Spreadsheet -- Enzyme Inhibition Constant Data from BindingDB
Found 2 hits for monomerid = 50377455
TargetAdenosine receptor A2a(Homo sapiens (Human))
Vernalis (R&D)
Curated by ChEMBL
LigandPNGBDBM50377455(CHEMBL264698)
Affinity DataKi:  5.74E+3nM. Assay description: Binding affinity to human adenosine A2A receptor
In DepthDetails ArticlePubMed
TargetAdenosine receptor A1(Homo sapiens (Human))
Vernalis (R&D)
Curated by ChEMBL
LigandPNGBDBM50377455(CHEMBL264698)
Affinity DataKi:  1.75E+4nM. Assay description: Binding affinity to human adenosine A1 receptor
In DepthDetails ArticlePubMed