BDBM50377756 CHEMBL256298
SMILES Cn1c(nnc1-c1ccccc1C(F)(F)F)-c1ccccc1Br
InChI Key InChIKey=MBOZUGMFGFMJRX-UHFFFAOYSA-N
Data  2 IC50
  Tab Delimited (TSV)   2D SDfile   Computed 3D by Vconf -m prep SDfile
Find this compound or compounds like it in BindingDB:
Activity Spreadsheet -- Enzyme Inhibition Constant Data from BindingDB
Found 2 hits for monomerid = 50377756
Target11-beta-hydroxysteroid dehydrogenase 1(Homo sapiens (Human))
Merck
Curated by ChEMBL
LigandPNGBDBM50377756(CHEMBL256298)
Affinity DataIC50:  1nM. Assay description: Inhibition of human 11beta-HSD1 expressed in CHO-K1 cells
In DepthDetails ArticlePubMed
Target11-beta-hydroxysteroid dehydrogenase 1(Mus musculus (mouse))
Merck
Curated by ChEMBL
LigandPNGBDBM50377756(CHEMBL256298)
Affinity DataIC50:  8nM. Assay description: Inhibition of mouse 11beta-HSD1 expressed in CHO-K1 cells
In DepthDetails ArticlePubMed