BDBM50378651 CHEMBL589310
SMILES Nc1c2C(=O)c3ccccc3C(=O)c2c(Nc2cccc3c(cccc23)S([O-])(=O)=O)cc1S([O-])(=O)=O
InChI Key InChIKey=JXGQGRLMYIYYKJ-UHFFFAOYSA-L
Data  1 KI
  Tab Delimited (TSV)   2D SDfile   Computed 3D by Vconf -m prep SDfile
Find this compound or compounds like it in BindingDB:
Activity Spreadsheet -- Enzyme Inhibition Constant Data from BindingDB
Found 1 hit for monomerid = 50378651
Target5'-nucleotidase(Rattus norvegicus (Rat))
University Of Bonn
Curated by ChEMBL
LigandPNGBDBM50378651(CHEMBL589310)
Affinity DataKi:  1.17E+4nM. Assay description: Inhibition of rat ecto-5'-nucleotidase expressed in Sf9 cells by capillary electrophoresis method
In DepthDetails ArticlePubMed