BDBM50378792 CHEMBL1170606
SMILES OC(=O)CNC(=O)COc1ccccc1\N=N\c1ccccc1OCC(=O)NCC(O)=O
InChI Key InChIKey=FAHVZBKDXQUPDE-WCWDXBQESA-N
Data  1 KI
  Tab Delimited (TSV)   2D SDfile   Computed 3D by Vconf -m prep SDfile
Find this compound or compounds like it in BindingDB:
Activity Spreadsheet -- Enzyme Inhibition Constant Data from BindingDB
Found 1 hit for monomerid = 50378792
TargetMembrane-bound transcription factor site-1 protease(Homo sapiens (Human))
Indian Institute Of Technology
Curated by ChEMBL
LigandPNGBDBM50378792(CHEMBL1170606)
Affinity DataKi:  2.65E+5nM. Assay description: Inhibition of human recombinant solubule Kexin isozyme 1
In DepthDetails ArticlePubMed