BDBM50379291 CHEMBL2011643
SMILES CC(C)[C@@H]1C[C@H](OC(=O)\C=C\c2ccc(O)cc2)[C@@]2(C)[C@H](O)CC=C(C)[C@@H]2[C@@H]1O[C@@H]1O[C@H](CO)[C@@H](O)[C@H](O)[C@H]1O
InChI Key InChIKey=FYIRTYWAWSCPCM-RQDXIEOQSA-N
Data  1 IC50
  Tab Delimited (TSV)   2D SDfile   Computed 3D by Vconf -m prep SDfile
Find this compound or compounds like it in BindingDB:
Activity Spreadsheet -- Enzyme Inhibition Constant Data from BindingDB
Found 1 hit for monomerid = 50379291
TargetAldo-keto reductase family 1 member B1(Rattus norvegicus)
Korean Institute Of Oriental Medicine (Kiom)
Curated by ChEMBL
LigandPNGBDBM50379291(CHEMBL2011643)
Affinity DataIC50: >3.00E+4nM. Assay description: Inhibition of Sprague-Dawley rat lens aldose reductase
In DepthDetails ArticlePubMed