BDBM50379609 CHEMBL2013019
SMILES CC(C)S(=O)(=O)NC[C@H]1CC[C@@H](CC1)NC(=O)Cn1ccc2c(Cl)cccc12
InChI Key InChIKey=VSZCUBGVEGARJW-WKILWMFISA-N
Data  1 KI
  Tab Delimited (TSV)   2D SDfile   Computed 3D by Vconf -m prep SDfile
Find this compound or compounds like it in BindingDB:
Activity Spreadsheet -- Enzyme Inhibition Constant Data from BindingDB
Found 1 hit for monomerid = 50379609
TargetNeuropeptide Y receptor type 5(Homo sapiens (Human))
Lundbeck Research Usa
Curated by ChEMBL
LigandPNGBDBM50379609(CHEMBL2013019)
Affinity DataKi:  1.70nM. Assay description: Displacement of [125I]peptide YY from human NPY5 receptor
In DepthDetails ArticlePubMed