BDBM50379610 CHEMBL2013018
SMILES CC(C)S(=O)(=O)NC[C@H]1CC[C@@H](CC1)NC(=O)Cn1ccc2ccccc12
InChI Key InChIKey=HGYRICRWNWOJQS-SAABIXHNSA-N
Data  1 KI
  Tab Delimited (TSV)   2D SDfile   Computed 3D by Vconf -m prep SDfile
Find this compound or compounds like it in BindingDB:
Activity Spreadsheet -- Enzyme Inhibition Constant Data from BindingDB
Found 1 hit for monomerid = 50379610
TargetNeuropeptide Y receptor type 5(Homo sapiens (Human))
Lundbeck Research Usa
Curated by ChEMBL
LigandPNGBDBM50379610(CHEMBL2013018)
Affinity DataKi:  1.5nM. Assay description: Displacement of [125I]peptide YY from human NPY5 receptor
In DepthDetails ArticlePubMed