BDBM50381053 CHEMBL2017322
SMILES N(c1ccccc1)c1nc2c(cccc2c2sccc12)-c1nnc[nH]1
InChI Key InChIKey=FCQKXMKELLUTAY-UHFFFAOYSA-N
Data  2 IC50
  Tab Delimited (TSV)   2D SDfile   Computed 3D by Vconf -m prep SDfile
Find this compound or compounds like it in BindingDB:
Activity Spreadsheet -- Enzyme Inhibition Constant Data from BindingDB
Found 2 hits for monomerid = 50381053
TargetSerine/threonine-protein kinase pim-1(Homo sapiens (Human))
Cylene Pharmaceuticals
Curated by ChEMBL
LigandPNGBDBM50381053(CHEMBL2017322)
Affinity DataIC50:  4nM. Assay description: Inhibition of human recombinant Pim1 using RSRHSSYPAGT as substrate and 30 uM ATP by radiometric assay
In DepthDetails ArticlePubMed
TargetSerine/threonine-protein kinase pim-2(Homo sapiens (Human))
Cylene Pharmaceuticals
Curated by ChEMBL
LigandPNGBDBM50381053(CHEMBL2017322)
Affinity DataIC50:  15nM. Assay description: Inhibition of human recombinant Pim2 using RSRHSSYPAGT as substrate and 5 uM ATP by radiometric assay
In DepthDetails ArticlePubMed