BDBM50381148 CHEMBL2018208
SMILES NS(=O)(=O)c1ccc(NC(=O)CSc2nnc3c4ccccc4n(CC=C)c3n2)cc1
InChI Key InChIKey=MXKWZTHNLYUULM-UHFFFAOYSA-N
Data  1 IC50
  Tab Delimited (TSV)   2D SDfile   Computed 3D by Vconf -m prep SDfile
Find this compound or compounds like it in BindingDB:
Activity Spreadsheet -- Enzyme Inhibition Constant Data from BindingDB
Found 1 hit for monomerid = 50381148
TargetAcetylcholinesterase(Electrophorus electricus (Electric eel))
China Pharmaceutical University
Curated by ChEMBL
LigandPNGBDBM50381148(CHEMBL2018208)
Affinity DataIC50:  6.50E+3nM. Assay description: Inhibition of electric eel AChE by Ellman's method
In DepthDetails ArticlePubMed