BDBM50381227 CHEMBL484378
SMILES CCCNC(=O)\C=C\C=C\c1ccc2OCOc2c1
InChI Key InChIKey=DPXAATAFNIAPIL-GGWOSOGESA-N
Data  2 IC50
  Tab Delimited (TSV)   2D SDfile   Computed 3D by Vconf -m prep SDfile
Find this compound or compounds like it in BindingDB:
Activity Spreadsheet -- Enzyme Inhibition Constant Data from BindingDB
Found 2 hits for monomerid = 50381227
TargetAmine oxidase [flavin-containing] B(Rattus norvegicus (rat))
General Hospital Of Pla
Curated by ChEMBL
LigandPNGBDBM50381227(CHEMBL484378)
Affinity DataIC50:  45nM. Assay description: Inhibition of MAO-B in Sprague-Dawley rat brain homogenate using kynuramine as substrate preincubated for 10 mins measured by fluorimetric assay
In DepthDetails ArticlePubMed
TargetAmine oxidase [flavin-containing] A(Rattus norvegicus (rat))
General Hospital Of Pla
Curated by ChEMBL
LigandPNGBDBM50381227(CHEMBL484378)
Affinity DataIC50:  3.66E+3nM. Assay description: Inhibition of MAO-A in Sprague-Dawley rat brain homogenate using kynuramine as substrate preincubated for 10 mins measured by fluorimetric assay
In DepthDetails ArticlePubMed