BDBM50381230 CHEMBL2018555
SMILES CC(=O)Oc1ccc(\C=C\C=C\C(=O)N2CCCCC2)cc1OC(C)=O
InChI Key InChIKey=FRTBVNGOQKIFQJ-KBXRYBNXSA-N
Data  2 IC50
  Tab Delimited (TSV)   2D SDfile   Computed 3D by Vconf -m prep SDfile
Find this compound or compounds like it in BindingDB:
Activity Spreadsheet -- Enzyme Inhibition Constant Data from BindingDB
Found 2 hits for monomerid = 50381230
TargetAmine oxidase [flavin-containing] B(Rattus norvegicus (rat))
General Hospital Of Pla
Curated by ChEMBL
LigandPNGBDBM50381230(CHEMBL2018555)
Affinity DataIC50:  750nM. Assay description: Inhibition of MAO-B in Sprague-Dawley rat brain homogenate using kynuramine as substrate preincubated for 10 mins measured by fluorimetric assay
In DepthDetails ArticlePubMed
TargetAmine oxidase [flavin-containing] A(Rattus norvegicus (rat))
General Hospital Of Pla
Curated by ChEMBL
LigandPNGBDBM50381230(CHEMBL2018555)
Affinity DataIC50:  1.28E+3nM. Assay description: Inhibition of MAO-A in Sprague-Dawley rat brain homogenate using kynuramine as substrate preincubated for 10 mins measured by fluorimetric assay
In DepthDetails ArticlePubMed