BDBM50383048 CHEMBL2031299
SMILES Brc1cccc(Nc2ncnc3ccc(NC(=O)CCN4CCOCC4)cc23)c1
InChI Key InChIKey=QXXYOYCCHAEKLL-UHFFFAOYSA-N
Data  1 IC50
  Tab Delimited (TSV)   2D SDfile   Computed 3D by Vconf -m prep SDfile
Find this compound or compounds like it in BindingDB:
Activity Spreadsheet -- Enzyme Inhibition Constant Data from BindingDB
Found 1 hit for monomerid = 50383048
TargetEpidermal growth factor receptor(Homo sapiens (Human))
Universit£
Curated by ChEMBL
LigandPNGBDBM50383048(CHEMBL2031299)
Affinity DataIC50:  0.510nM. Assay description: Inhibition of human recombinant EGFR using Ulight-CAGAGAIETDKEYYTVKD as substrate after 15 mins by time-resolved fluorimetric analysis
In DepthDetails ArticlePubMed