BDBM50383056 CHEMBL2031307
SMILES CCOc1cc2ncc(C#N)c(Nc3ccc(F)c(Cl)c3)c2cc1NC(=O)CCN(C)C
InChI Key InChIKey=DRBYRIHQPVZFMW-UHFFFAOYSA-N
Data  1 IC50
  Tab Delimited (TSV)   2D SDfile   Computed 3D by Vconf -m prep SDfile
Find this compound or compounds like it in BindingDB:
Activity Spreadsheet -- Enzyme Inhibition Constant Data from BindingDB
Found 1 hit for monomerid = 50383056
TargetEpidermal growth factor receptor(Homo sapiens (Human))
Universit£
Curated by ChEMBL
LigandPNGBDBM50383056(CHEMBL2031307)
Affinity DataIC50:  0.680nM. Assay description: Inhibition of human recombinant EGFR using Ulight-CAGAGAIETDKEYYTVKD as substrate after 15 mins by time-resolved fluorimetric analysis
In DepthDetails ArticlePubMed