BDBM50383059 CHEMBL2031313
SMILES CCOc1cc2ncc(C#N)c(Nc3ccc(OCc4ccccn4)c(Cl)c3)c2cc1NC(=O)CCN1CCOCC1
InChI Key InChIKey=CYRAGAWSGXXYDS-UHFFFAOYSA-N
Data  1 IC50
  Tab Delimited (TSV)   2D SDfile   Computed 3D by Vconf -m prep SDfile
Find this compound or compounds like it in BindingDB:
Activity Spreadsheet -- Enzyme Inhibition Constant Data from BindingDB
Found 1 hit for monomerid = 50383059
TargetEpidermal growth factor receptor(Homo sapiens (Human))
Universit£
Curated by ChEMBL
LigandPNGBDBM50383059(CHEMBL2031313)
Affinity DataIC50:  37.5nM. Assay description: Inhibition of human recombinant EGFR using Ulight-CAGAGAIETDKEYYTVKD as substrate after 15 mins by time-resolved fluorimetric analysis
In DepthDetails ArticlePubMed