BDBM50383282 CHEMBL2029427
SMILES CNc1ncc2CN(C)C(=O)N(c3cccc(NC(=O)C=C)c3)c2n1
InChI Key InChIKey=LYESCJLRRXBLPH-UHFFFAOYSA-N
Data  1 IC50
  Tab Delimited (TSV)   2D SDfile   Computed 3D by Vconf -m prep SDfile
Find this compound or compounds like it in BindingDB:
Activity Spreadsheet -- Enzyme Inhibition Constant Data from BindingDB
Found 1 hit for monomerid = 50383282
TargetEpidermal growth factor receptor(Homo sapiens (Human))
Chinese Academy Of Sciences
Curated by ChEMBL
LigandPNGBDBM50383282(CHEMBL2029427)
Affinity DataIC50:  929nM. Assay description: Inhibition of EGFR after 1.5 hr by FRET assay
In DepthDetails ArticlePubMed