BDBM50383295 CHEMBL2029441
SMILES COc1cc(ccc1Nc1ncc2CN(C(=O)N(c3cccc(NC(=O)C=C)c3)c2n1)c1ccc(OCc2ccccc2)cc1)N1CCN(C)CC1
InChI Key InChIKey=HXIOWWFZWFQOMH-UHFFFAOYSA-N
Data  1 IC50
  Tab Delimited (TSV)   2D SDfile   Computed 3D by Vconf -m prep SDfile
Find this compound or compounds like it in BindingDB:
Activity Spreadsheet -- Enzyme Inhibition Constant Data from BindingDB
Found 1 hit for monomerid = 50383295
TargetEpidermal growth factor receptor(Homo sapiens (Human))
Chinese Academy Of Sciences
Curated by ChEMBL
LigandPNGBDBM50383295(CHEMBL2029441)
Affinity DataIC50:  1.67nM. Assay description: Inhibition of EGFR after 1.5 hr by FRET assay
In DepthDetails ArticlePubMed