BDBM50383780 CHEMBL2030814
SMILES OC(=O)[C@H](Cc1cccc(OCCNc2ccccn2)c1)NC(=O)c1c(Cl)cccc1Cl
InChI Key InChIKey=KGOLCHLCEKRXMA-IBGZPJMESA-N
Data  2 IC50
  Tab Delimited (TSV)   2D SDfile   Computed 3D by Vconf -m prep SDfile
Find this compound or compounds like it in BindingDB:
Activity Spreadsheet -- Enzyme Inhibition Constant Data from BindingDB
Found 2 hits for monomerid = 50383780
TargetIntegrin alpha-5/beta-1(Homo sapiens (Human))
Astrazeneca
Curated by ChEMBL
LigandPNGBDBM50383780(CHEMBL2030814)
Affinity DataIC50: >2.90E+5nM. Assay description: Antagonist activity at integrin alpha5beta1 in human K562 cells assessed as inhibition of cell adhesion
In DepthDetails ArticlePubMed
TargetIntegrin alpha-5/beta-1(Homo sapiens (Human))
Astrazeneca
Curated by ChEMBL
LigandPNGBDBM50383780(CHEMBL2030814)
Affinity DataIC50:  5.90E+3nM. Assay description: Binding affinity to integrin alpha5beta1
In DepthDetails ArticlePubMed