BDBM50384537 CHEMBL2036430
SMILES CN(C)c1ccc(cc1)\N=N\c1nc2ccc(I)cc2s1
InChI Key InChIKey=DDEDTRQKFDAWHH-VHEBQXMUSA-N
Data  1 KI
  Tab Delimited (TSV)   2D SDfile   Computed 3D by Vconf -m prep SDfile
Find this compound or compounds like it in BindingDB:
Activity Spreadsheet -- Enzyme Inhibition Constant Data from BindingDB
Found 1 hit for monomerid = 50384537
TargetMicrotubule-associated protein tau(Homo sapiens (Human))
TBA
Curated by ChEMBL
LigandPNGBDBM50384537(CHEMBL2036430)
Affinity DataKi:  0.480nM. Assay description: Displacement of Thioflavin S from recombinant human tau expressed in Escherichia coli after 30 mins by fluorescence assay
In DepthDetails ArticlePubMed