BDBM50385137 CHEMBL2037290
SMILES Cc1cccc2oc(nc12)-c1cccc(C[C@H](O)\C=C\[C@H]2CCC(=O)N2CCSc2nc(cs2)C(O)=O)c1
InChI Key InChIKey=LBKVVYLADFVUQO-BPFVEMAFSA-N
Data  4 KI  2 EC50
  Tab Delimited (TSV)   2D SDfile   Computed 3D by Vconf -m prep SDfile
Find this compound or compounds like it in BindingDB:
Activity Spreadsheet -- Enzyme Inhibition Constant Data from BindingDB
Found 6 hits for monomerid = 50385137
TargetProstaglandin E2 receptor EP4 subtype(Mus musculus (Mouse))
Minase Research Institute
Curated by ChEMBL
LigandPNGBDBM50385137(CHEMBL2037290)
Affinity DataKi:  0.210nM. Assay description: Displacement of [3H]PGE2 from mouse EP4 receptor expressed in CHO cells after 60 mins by scintillation counting
In DepthDetails ArticlePubMed
TargetProstaglandin E2 receptor EP2 subtype(Mus musculus (Mouse))
Minase Research Institute
Curated by ChEMBL
LigandPNGBDBM50385137(CHEMBL2037290)
Affinity DataKi:  22nM. Assay description: Displacement of [3H]PGE2 from mouse EP2 receptor expressed in CHO cells after 60 mins by scintillation counting
In DepthDetails ArticlePubMed
TargetProstaglandin E2 receptor EP1 subtype(Mus musculus (Mouse))
Minase Research Institute
Curated by ChEMBL
LigandPNGBDBM50385137(CHEMBL2037290)
Affinity DataKi:  7.70E+3nM. Assay description: Displacement of [3H]PGE2 from mouse EP1 receptor expressed in CHO cells after 20 mins by scintillation counting
In DepthDetails ArticlePubMed
TargetProstaglandin E2 receptor EP3 subtype(Mus musculus (Mouse))
Minase Research Institute
Curated by ChEMBL
LigandPNGBDBM50385137(CHEMBL2037290)
Affinity DataKi: >1.00E+4nM. Assay description: Displacement of [3H]PGE2 from mouse EP3 receptor expressed in CHO cells after 60 mins by scintillation counting
In DepthDetails ArticlePubMed
TargetProstaglandin E2 receptor EP4 subtype(Rattus norvegicus)
Minase Research Institute
Curated by ChEMBL
LigandPNGBDBM50385137(CHEMBL2037290)
Affinity DataEC50:  28nM. Assay description: Agonist activity at rat EP4 receptor expressed in CHO cells assessed as cAMP production after 10 mins by radioimmunoassay
In DepthDetails ArticlePubMed
TargetProstaglandin E2 receptor EP2 subtype(Rattus norvegicus)
Minase Research Institute
Curated by ChEMBL
LigandPNGBDBM50385137(CHEMBL2037290)
Affinity DataEC50:  8.50E+3nM. Assay description: Agonist activity at rat EP2 receptor expressed in CHO cells assessed as cAMP production after 10 mins by radioimmunoassay
In DepthDetails ArticlePubMed