BDBM50388881 CHEMBL2063116
SMILES Fc1cccc([C@H]2CC[C@H](OC(=O)N3CCC(CC3)n3c4cccnc4[nH]c3=O)c3ncccc3C2)c1F
InChI Key InChIKey=VUNYPRIWWJSQTR-SBUREZEXSA-N
Data  1 KI
  Tab Delimited (TSV)   2D SDfile   Computed 3D by Vconf -m prep SDfile
Find this compound or compounds like it in BindingDB:
Activity Spreadsheet -- Enzyme Inhibition Constant Data from BindingDB
Found 1 hit for monomerid = 50388881
TargetCalcitonin gene-related peptide type 1 receptor(Homo sapiens (Human))
TBA
Curated by ChEMBL
LigandPNGBDBM50388881(CHEMBL2063116)
Affinity DataKi:  940nM. Assay description: Displacement of [125I]-CGRP from CGRP receptor in human SK-N-MC cells
In DepthDetails ArticlePubMed