BDBM50389841 CHEMBL2070717
SMILES Cc1cc(NC(=O)CSc2nc3ccccc3c3nc4ccccc4n23)[nH]n1
InChI Key InChIKey=DVMPSAOLVIMIJD-UHFFFAOYSA-N
Data  1 KI
  Tab Delimited (TSV)   2D SDfile   Computed 3D by Vconf -m prep SDfile
Find this compound or compounds like it in BindingDB:
Activity Spreadsheet -- Enzyme Inhibition Constant Data from BindingDB
Found 1 hit for monomerid = 50389841
TargetAdenosine receptor A2a(Homo sapiens (Human))
Radboud University Nijmegen Medical Centre
Curated by ChEMBL
LigandPNGBDBM50389841(CHEMBL2070717)
Affinity DataKi:  631nM. Assay description: Displacement of [3H]ZM241385 from human AA2AR expressed in HEK293T cells after 2 hrs by liquid scintillation counter
In DepthDetails ArticlePubMed