BDBM50390208 CHEMBL203493
SMILES C(Cc1ccccc1)Nc1ncnc2n(\C=C/c3ccccc3)ncc12
InChI Key InChIKey=PJKOGVIETUPXRU-OWBHPGMISA-N
Data  1 KI
  Tab Delimited (TSV)   2D SDfile   Computed 3D by Vconf -m prep SDfile
Find this compound or compounds like it in BindingDB:
Activity Spreadsheet -- Enzyme Inhibition Constant Data from BindingDB
Found 1 hit for monomerid = 50390208
TargetTyrosine-protein kinase ABL1(Homo sapiens (Human))
University Of Siena
Curated by ChEMBL
LigandPNGBDBM50390208(CHEMBL203493)
Affinity DataKi:  9.75E+3nM. Assay description: Inhibition of Abl
In DepthDetails ArticlePubMed