BDBM50391476 CHEMBL2147080
SMILES Cn1c2ccc(cc2c2nc(N3CCC[C@@H](N)C3)n(Cc3ccccc3Cl)c2c1=O)C(N)=O
InChI Key InChIKey=SBKVNNNINIOPNC-MRXNPFEDSA-N
Data  1 IC50
  Tab Delimited (TSV)   2D SDfile   Computed 3D by Vconf -m prep SDfile
Find this compound or compounds like it in BindingDB:
Activity Spreadsheet -- Enzyme Inhibition Constant Data from BindingDB
Found 1 hit for monomerid = 50391476
TargetDipeptidyl peptidase 4(Homo sapiens (Human))
Dainippon Sumitomo Pharma
Curated by ChEMBL
LigandPNGBDBM50391476(CHEMBL2147080)
Affinity DataIC50:  14nM. Assay description: Inhibition of DPP4 in human plasma using Gly-Pro-AMC as substrate by fluorimetric analysis
In DepthDetails ArticlePubMed