BDBM50391882 CHEMBL2147416
SMILES C[C@H]1[C@@H](C)[C@H](O[C@@H]1c1ccc(O)cc1)c1ccc(O)cc1
InChI Key InChIKey=PIBJADPEZQHMQS-CMKMFDCUSA-N
Data  4 IC50
  Tab Delimited (TSV)   2D SDfile   Computed 3D by Vconf -m prep SDfile
Find this compound or compounds like it in BindingDB:
Activity Spreadsheet -- Enzyme Inhibition Constant Data from BindingDB
Found 4 hits for monomerid = 50391882
TargetProstaglandin E synthase(Homo sapiens (Human))
University Of Innsbruck
Curated by ChEMBL
LigandPNGBDBM50391882(CHEMBL2147416)
Affinity DataIC50: >5.00E+4nM. Assay description: Inhibition of mPGES1 in IL-1beta treated human A549 cell microsomal membrane assessed as inhibition of PGE2 formation incubated for 15 mins before ad...
In DepthDetails ArticlePubMed
TargetProstaglandin G/H synthase 1(Ovis aries (Sheep))
University Of Innsbruck
Curated by ChEMBL
LigandPNGBDBM50391882(CHEMBL2147416)
Affinity DataIC50: >5.00E+4nM. Assay description: Inhibition of ram seminal vesicle COX1 assessed as PGE2 production by enzyme immunoassay
In DepthDetails ArticlePubMed
TargetProstaglandin G/H synthase 2(Ovis aries (Sheep))
University Of Innsbruck
Curated by ChEMBL
LigandPNGBDBM50391882(CHEMBL2147416)
Affinity DataIC50: >5.00E+4nM. Assay description: Inhibition of sheep placental COX2 assessed as PGE2 production by enzyme immunoassay
In DepthDetails ArticlePubMed
TargetPolyunsaturated fatty acid 5-lipoxygenase(Homo sapiens (Human))
University Of Innsbruck
Curated by ChEMBL
LigandPNGBDBM50391882(CHEMBL2147416)
Affinity DataIC50: >5.00E+4nM. Assay description: Inhibition of 5-lipoxygenase in human neutrophils assessed as inhibition of LTB4 production
In DepthDetails ArticlePubMed