BDBM50391973 CHEMBL2152282
SMILES CN(C)CCOc1cc(N)cc(c1)-c1cnc2[nH]cc(-c3ccncc3)c2c1
InChI Key InChIKey=FODYGLVSIXDICS-UHFFFAOYSA-N
Data  1 IC50
  Tab Delimited (TSV)   2D SDfile   Computed 3D by Vconf -m prep SDfile
Find this compound or compounds like it in BindingDB:
Activity Spreadsheet -- Enzyme Inhibition Constant Data from BindingDB
Found 1 hit for monomerid = 50391973
TargetHigh affinity nerve growth factor receptor(Homo sapiens (Human))
Korea Advanced Institute Of Science And Technology (Kaist)
Curated by ChEMBL
LigandPNGBDBM50391973(CHEMBL2152282)
Affinity DataIC50:  13.6nM. Assay description: Inhibition of TRKA assessed as [gamma33P]ATP incorporation into substrate
In DepthDetails ArticlePubMed