BDBM50392649 CHEMBL2153712
SMILES CC(=O)N(CC1CCc2nc(N)nc(N)c2N1C=O)c1ccc(cc1)C(=O)N[C@@H](CCC(O)=O)C(O)=O
InChI Key InChIKey=RLSFCZKHGJOKFZ-LWKPJOBUSA-N
Data  2 IC50
  Tab Delimited (TSV)   2D SDfile   Computed 3D by Vconf -m prep SDfile
Find this compound or compounds like it in BindingDB:
Activity Spreadsheet -- Enzyme Inhibition Constant Data from BindingDB
Found 2 hits for monomerid = 50392649
TargetMethionine synthase(Homo sapiens (Human))
Peking University
Curated by ChEMBL
LigandPNGBDBM50392649(CHEMBL2153712)
Affinity DataIC50:  1.73E+3nM. Assay description: Inhibition of methionine synthase in human HL60 cells using L-homocysteine as substrate incubated for 3 hrs prior to substrate addition measured afte...
In DepthDetails ArticlePubMed
TargetDihydrofolate reductase(Homo sapiens (Human))
Peking University
Curated by ChEMBL
LigandPNGBDBM50392649(CHEMBL2153712)
Affinity DataIC50: >1.00E+5nM. Assay description: Inhibition of human recombinant DHFR using dihydrofolate as substrate by spectrophotometric analysis
In DepthDetails ArticlePubMed