BDBM50392789 CHEMBL2151319::US8486966, 3
SMILES C[C@H](Nc1ccc2ncn(-c3cc([nH]n3)C3CC3)c2n1)c1ncc(F)cn1
InChI Key InChIKey=YKPNHIXFGPKGEI-JTQLQIEISA-N
Data  2 IC50
  Tab Delimited (TSV)   2D SDfile   Computed 3D by Vconf -m prep SDfile
Find this compound or compounds like it in BindingDB:
Activity Spreadsheet -- Enzyme Inhibition Constant Data from BindingDB
Found 2 hits for monomerid = 50392789
TargetPotassium voltage-gated channel subfamily H member 2(Homo sapiens (Human))
TBA
Curated by ChEMBL
LigandPNGBDBM50392789(CHEMBL2151319 | US8486966, 3)
Affinity DataIC50: >3.20E+4nM. Assay description: Inhibition of human ERG
In DepthDetails ArticlePubMed
TargetHigh affinity nerve growth factor receptor(Homo sapiens (Human))
Astrazeneca
US Patent
LigandPNGBDBM50392789(CHEMBL2151319 | US8486966, 3)
Affinity DataIC50:  3nMT: 2°C. Assay description: JAK2 and Trk A kinase activity was determined by measuring the kinase's ability to phoshorylate synthetic tyrosine residues within a generic poly...
In DepthDetails US Patent