BDBM50393547 CHEMBL2158287
SMILES OC[C@@H](O)C(=O)N1CCC(CC1)c1ccc(NC(=O)c2ncc([nH]2)C#N)c(c1)C1=CCCCC1
InChI Key InChIKey=USCISWISWCWWPX-JOCHJYFZSA-N
Data  6 IC50
  Tab Delimited (TSV)   2D SDfile   Computed 3D by Vconf -m prep SDfile
Find this compound or compounds like it in BindingDB:
Activity Spreadsheet -- Enzyme Inhibition Constant Data from BindingDB
Found 6 hits for monomerid = 50393547
TargetMacrophage colony-stimulating factor 1 receptor(Homo sapiens (Human))
Johnson & Johnson Pharmaceutical Research & Development
Curated by ChEMBL
LigandPNGBDBM50393547(CHEMBL2158287)
Affinity DataIC50:  1.20nM. Assay description: Inhibition of FMS mediated phosphorylation using SYEGNSYTFIDPTQ as substrate after 80 mins by fluorescence polarization
In DepthDetails ArticlePubMed
TargetMacrophage colony-stimulating factor 1 receptor(Mus musculus (Mouse))
Johnson & Johnson Pharmaceutical Research & Development
Curated by ChEMBL
LigandPNGBDBM50393547(CHEMBL2158287)
Affinity DataIC50:  2.30nM. Assay description: Inhibition of FMS-mediated proliferation in CSF1-stimulated bone marrow-derived mouse macrophages assessed as inhibition of incorporation of bromodeo...
In DepthDetails ArticlePubMed
TargetCytochrome P450 3A4(Homo sapiens (Human))
Johnson & Johnson Pharmaceutical Research & Development
Curated by ChEMBL
LigandPNGBDBM50393547(CHEMBL2158287)
Affinity DataIC50:  8.20E+3nM. Assay description: Inhibition of CYP3A4
In DepthDetails ArticlePubMed
TargetCytochrome P450 2C9(Homo sapiens (Human))
Johnson & Johnson Pharmaceutical Research & Development
Curated by ChEMBL
LigandPNGBDBM50393547(CHEMBL2158287)
Affinity DataIC50: >1.00E+4nM. Assay description: Inhibition of CYP2C9
In DepthDetails ArticlePubMed
TargetCytochrome P450 2C19(Homo sapiens (Human))
Johnson & Johnson Pharmaceutical Research & Development
Curated by ChEMBL
LigandPNGBDBM50393547(CHEMBL2158287)
Affinity DataIC50:  9.80E+3nM. Assay description: Inhibition of CYP2C19
In DepthDetails ArticlePubMed
TargetCytochrome P450 1A2(Homo sapiens (Human))
Johnson & Johnson Pharmaceutical Research & Development
Curated by ChEMBL
LigandPNGBDBM50393547(CHEMBL2158287)
Affinity DataIC50: >1.00E+4nM. Assay description: Inhibition of CYP1A2
In DepthDetails ArticlePubMed