BDBM50394057 CHEMBL2158576
SMILES COc1cc(Cl)c(cc1OC)-c1nc(SCC(=O)NCCF)nc2[nH]cc(C#N)c12
InChI Key InChIKey=SYXPLDZVFNCBAG-UHFFFAOYSA-N
Data  1 KI
  Tab Delimited (TSV)   2D SDfile   Computed 3D by Vconf -m prep SDfile
Find this compound or compounds like it in BindingDB:
Activity Spreadsheet -- Enzyme Inhibition Constant Data from BindingDB
Found 1 hit for monomerid = 50394057
TargetHeat shock protein HSP 90-beta(Homo sapiens (Human))
Vernalis
Curated by ChEMBL
LigandPNGBDBM50394057(CHEMBL2158576)
Affinity DataKi:  5nM. Assay description: Inhibition of fluorescently labeled VER51001 binding to full length human HSP90beta after 30 mins by fluorescence polarization assay
In DepthDetails ArticlePubMed