BDBM50394666 CHEMBL248705
SMILES CC1C(=O)S[C@@](C)(\C=C(/C)C=C)C1=O
InChI Key InChIKey=IKJRVRCIDNWYPZ-CJLIJQJQSA-N
Data  1 IC50
  Tab Delimited (TSV)   2D SDfile   Computed 3D by Vconf -m prep SDfile
Find this compound or compounds like it in BindingDB:
Activity Spreadsheet -- Enzyme Inhibition Constant Data from BindingDB
Found 1 hit for monomerid = 50394666
TargetFatty acid synthase(Homo sapiens (Human))
Wayne State University
Curated by ChEMBL
LigandPNGBDBM50394666(CHEMBL248705)
Affinity DataIC50:  2.08E+5nM. Assay description: Inhibition of FASN in human HepG2 cells
In DepthDetails ArticlePubMed