BDBM50395032 CHEMBL2163851
SMILES O=c1ccn(CCCCc2cnnn2CCc2cccc(OCC3CC3)c2)c(=O)[nH]1
InChI Key InChIKey=DAEJBNOQVMAMEV-UHFFFAOYSA-N
Data  1 IC50  1 EC50
  Tab Delimited (TSV)   2D SDfile   Computed 3D by Vconf -m prep SDfile
Find this compound or compounds like it in BindingDB:
Activity Spreadsheet -- Enzyme Inhibition Constant Data from BindingDB
Found 2 hits for monomerid = 50395032
TargetDeoxyuridine 5'-triphosphate nucleotidohydrolase, mitochondrial(Homo sapiens (Human))
Taiho Pharmaceutical
Curated by ChEMBL
LigandPNGBDBM50395032(CHEMBL2163851)
Affinity DataEC50:  260nM. Assay description: Inhibition of dUTPase in human HeLa S3 cells assessed as potentiation of 1 uM FdUrd-induced decrease in cell density incubated for 48 hrs by crystal ...
In DepthDetails ArticlePubMed
TargetDeoxyuridine 5'-triphosphate nucleotidohydrolase, mitochondrial(Homo sapiens (Human))
Taiho Pharmaceutical
Curated by ChEMBL
LigandPNGBDBM50395032(CHEMBL2163851)
Affinity DataIC50:  210nM. Assay description: Inhibition of human dUTPase assessed as reduction in [5-3H]dUMP production incubated for 15 mins by HPLC
In DepthDetails ArticlePubMed