BDBM50395040 CHEMBL2163860
SMILES CC[C@@](O)(Cn1nncc1CCCCn1ccc(=O)[nH]c1=O)c1cccc(OCC(C)C)c1
InChI Key InChIKey=OKZDLGKCGTUJAV-XMMPIXPASA-N
Data  1 IC50
  Tab Delimited (TSV)   2D SDfile   Computed 3D by Vconf -m prep SDfile
Find this compound or compounds like it in BindingDB:
Activity Spreadsheet -- Enzyme Inhibition Constant Data from BindingDB
Found 1 hit for monomerid = 50395040
TargetDeoxyuridine 5'-triphosphate nucleotidohydrolase, mitochondrial(Homo sapiens (Human))
Taiho Pharmaceutical
Curated by ChEMBL
LigandPNGBDBM50395040(CHEMBL2163860)
Affinity DataIC50:  550nM. Assay description: Inhibition of human dUTPase assessed as reduction in [5-3H]dUMP production incubated for 15 mins by HPLC
In DepthDetails ArticlePubMed