BDBM50395054 CHEMBL2163871
SMILES O=c1ccn(CCCCc2cnnn2C(c2ccccc2)c2ccccc2)c(=O)[nH]1
InChI Key InChIKey=QWFGBFXOOZVULQ-UHFFFAOYSA-N
Data  1 IC50
  Tab Delimited (TSV)   2D SDfile   Computed 3D by Vconf -m prep SDfile
Find this compound or compounds like it in BindingDB:
Activity Spreadsheet -- Enzyme Inhibition Constant Data from BindingDB
Found 1 hit for monomerid = 50395054
TargetDeoxyuridine 5'-triphosphate nucleotidohydrolase, mitochondrial(Homo sapiens (Human))
Taiho Pharmaceutical
Curated by ChEMBL
LigandPNGBDBM50395054(CHEMBL2163871)
Affinity DataIC50:  1.60E+3nM. Assay description: Inhibition of human dUTPase assessed as reduction in [5-3H]dUMP production incubated for 15 mins by HPLC
In DepthDetails ArticlePubMed