BDBM50395522 CHEMBL2164426
SMILES C[C@@H](CO)NS(=O)(=O)c1ccc(cc1)-c1ccnc2[nH]c(cc12)C1CC1
InChI Key InChIKey=ZEVAYPOLTQWGHH-LBPRGKRZSA-N
Data  2 IC50
  Tab Delimited (TSV)   2D SDfile   Computed 3D by Vconf -m prep SDfile
Find this compound or compounds like it in BindingDB:
Activity Spreadsheet -- Enzyme Inhibition Constant Data from BindingDB
Found 2 hits for monomerid = 50395522
TargetInhibitor of nuclear factor kappa-B kinase subunit beta(Homo sapiens (Human))
Glaxosmithkline
Curated by ChEMBL
LigandPNGBDBM50395522(CHEMBL2164426)
Affinity DataIC50:  7.94nM. Assay description: Inhibition of IKK2 in presence of 1 uM ATP
In DepthDetails ArticlePubMed
TargetInhibitor of nuclear factor kappa-B kinase subunit alpha(Homo sapiens (Human))
Glaxosmithkline
Curated by ChEMBL
LigandPNGBDBM50395522(CHEMBL2164426)
Affinity DataIC50:  251nM. Assay description: Inhibition of IKK1 in presence of 1 uM ATP
In DepthDetails ArticlePubMed