BDBM50398901 CHEMBL2178203
SMILES COc1ccc(cc1)-c1c(C(=O)NC(N)=NCc2cc(Cl)cc(Cl)c2)c(C)nn1C
InChI Key InChIKey=KCBZDZJRCWQDNY-UHFFFAOYSA-N
Data  1 KI
  Tab Delimited (TSV)   2D SDfile   Computed 3D by Vconf -m prep SDfile
Find this compound or compounds like it in BindingDB:
Activity Spreadsheet -- Enzyme Inhibition Constant Data from BindingDB
Found 1 hit for monomerid = 50398901
TargetBeta-secretase 1(Homo sapiens (Human))
Bristol-Myers Squibb Research
Curated by ChEMBL
LigandPNGBDBM50398901(CHEMBL2178203)
Affinity DataKi:  4.00E+3nM. Assay description: Displacement of [3H]BMS-599240 from BACE1 expressed in HEK293 cells
In DepthDetails ArticlePubMed