BDBM50398913 CHEMBL2178207
SMILES Cc1onc(c1C(=O)NC(N)=NCc1cccc2ccccc12)-c1ccc(F)cc1
InChI Key InChIKey=VBTNJLBMOPJUGT-UHFFFAOYSA-N
Data  1 KI
  Tab Delimited (TSV)   2D SDfile   Computed 3D by Vconf -m prep SDfile
Find this compound or compounds like it in BindingDB:
Activity Spreadsheet -- Enzyme Inhibition Constant Data from BindingDB
Found 1 hit for monomerid = 50398913
TargetBeta-secretase 1(Homo sapiens (Human))
Bristol-Myers Squibb Research
Curated by ChEMBL
LigandPNGBDBM50398913(CHEMBL2178207)
Affinity DataKi:  1.80E+3nM. Assay description: Displacement of [3H]BMS-599240 from BACE1 expressed in HEK293 cells
In DepthDetails ArticlePubMed