BDBM50400012 CHEMBL2177705
SMILES COc1ccc(cc1)N(C)C(=O)Oc1cccc2NCC(CCC(O)=O)c12
InChI Key InChIKey=QBFXFWZZCFBLJE-UHFFFAOYSA-N
Data  2 IC50
  Tab Delimited (TSV)   2D SDfile   Computed 3D by Vconf -m prep SDfile
Find this compound or compounds like it in BindingDB:
Activity Spreadsheet -- Enzyme Inhibition Constant Data from BindingDB
Found 2 hits for monomerid = 50400012
TargetCarboxylic ester hydrolase(Equus caballus (Horse))
Bar-Ilan University
Curated by ChEMBL
LigandPNGBDBM50400012(CHEMBL2177705)
Affinity DataIC50:  4.17E+5nM. Assay description: Inhibition of equine BuChE after 120 mins by Ellman's method
In DepthDetails ArticlePubMed
TargetAcetylcholinesterase(Bos taurus (bovine))
Bar-Ilan University
Curated by ChEMBL
LigandPNGBDBM50400012(CHEMBL2177705)
Affinity DataIC50:  3.78E+4nM. Assay description: Inhibition of bovine AChE after 120 mins by Ellman's method
In DepthDetails ArticlePubMed