BDBM50400015 CHEMBL2177702
SMILES CCN(C)C(=O)Oc1cccc2NCC(CCC(N)=O)c12
InChI Key InChIKey=WKIMOGSQSSZRGR-UHFFFAOYSA-N
Data  2 IC50
  Tab Delimited (TSV)   2D SDfile   Computed 3D by Vconf -m prep SDfile
Find this compound or compounds like it in BindingDB:
Activity Spreadsheet -- Enzyme Inhibition Constant Data from BindingDB
Found 2 hits for monomerid = 50400015
TargetCarboxylic ester hydrolase(Equus caballus (Horse))
Bar-Ilan University
Curated by ChEMBL
LigandPNGBDBM50400015(CHEMBL2177702)
Affinity DataIC50:  8.50E+3nM. Assay description: Inhibition of equine BuChE after 120 mins by Ellman's method
In DepthDetails ArticlePubMed
TargetAcetylcholinesterase(Bos taurus (bovine))
Bar-Ilan University
Curated by ChEMBL
LigandPNGBDBM50400015(CHEMBL2177702)
Affinity DataIC50:  6.20E+4nM. Assay description: Inhibition of bovine AChE after 120 mins by Ellman's method
In DepthDetails ArticlePubMed