BDBM50400022 CHEMBL2177721
SMILES CCN(C)C(=O)Oc1cccc2n(C)cc(CCC(=O)OC)c12
InChI Key InChIKey=CSRARZAQGZERCG-UHFFFAOYSA-N
Data  1 IC50
  Tab Delimited (TSV)   2D SDfile   Computed 3D by Vconf -m prep SDfile
Find this compound or compounds like it in BindingDB:
Activity Spreadsheet -- Enzyme Inhibition Constant Data from BindingDB
Found 1 hit for monomerid = 50400022
TargetAcetylcholinesterase(Bos taurus (bovine))
Bar-Ilan University
Curated by ChEMBL
LigandPNGBDBM50400022(CHEMBL2177721)
Affinity DataIC50:  1.80E+5nM. Assay description: Inhibition of bovine AChE after 120 mins by Ellman's method
In DepthDetails ArticlePubMed