BDBM50400023 CHEMBL2177720
SMILES CCN(C)C(=O)Oc1cccc2[nH]cc(CCC(=O)OC)c12
InChI Key InChIKey=VYEDEGWIJABQRY-UHFFFAOYSA-N
Data  2 IC50
  Tab Delimited (TSV)   2D SDfile   Computed 3D by Vconf -m prep SDfile
Find this compound or compounds like it in BindingDB:
Activity Spreadsheet -- Enzyme Inhibition Constant Data from BindingDB
Found 2 hits for monomerid = 50400023
TargetCarboxylic ester hydrolase(Equus caballus (Horse))
Bar-Ilan University
Curated by ChEMBL
LigandPNGBDBM50400023(CHEMBL2177720)
Affinity DataIC50:  9.50E+3nM. Assay description: Inhibition of equine BuChE after 120 mins by Ellman's method
In DepthDetails ArticlePubMed
TargetAcetylcholinesterase(Bos taurus (bovine))
Bar-Ilan University
Curated by ChEMBL
LigandPNGBDBM50400023(CHEMBL2177720)
Affinity DataIC50:  1.96E+4nM. Assay description: Inhibition of bovine AChE after 120 mins by Ellman's method
In DepthDetails ArticlePubMed