BDBM50400026 CHEMBL2177717
SMILES CCN(C)C(=O)Oc1ccc2CCN(C)c2c1
InChI Key InChIKey=VJLWVTVBSDRGMC-UHFFFAOYSA-N
Data  2 IC50
  Tab Delimited (TSV)   2D SDfile   Computed 3D by Vconf -m prep SDfile
Find this compound or compounds like it in BindingDB:
Activity Spreadsheet -- Enzyme Inhibition Constant Data from BindingDB
Found 2 hits for monomerid = 50400026
TargetAcetylcholinesterase(Bos taurus (bovine))
Bar-Ilan University
Curated by ChEMBL
LigandPNGBDBM50400026(CHEMBL2177717)
Affinity DataIC50:  4.18E+5nM. Assay description: Inhibition of bovine AChE after 120 mins by Ellman's method
In DepthDetails ArticlePubMed
TargetCarboxylic ester hydrolase(Equus caballus (Horse))
Bar-Ilan University
Curated by ChEMBL
LigandPNGBDBM50400026(CHEMBL2177717)
Affinity DataIC50:  5.87E+4nM. Assay description: Inhibition of equine BuChE after 120 mins by Ellman's method
In DepthDetails ArticlePubMed