BDBM50400439 CHEMBL2177802
SMILES Cc1c(OCc2ccc3ccc(Cl)cc3n2)ccc2c(C)c(CCC(O)=O)c(=O)oc12
InChI Key InChIKey=STRORUAJCXLTID-UHFFFAOYSA-N
Data  1 IC50
  Tab Delimited (TSV)   2D SDfile   Computed 3D by Vconf -m prep SDfile
Find this compound or compounds like it in BindingDB:
Activity Spreadsheet -- Enzyme Inhibition Constant Data from BindingDB
Found 1 hit for monomerid = 50400439
TargetReplicative DNA helicase(Bacillus anthracis)
Microbiotix
Curated by ChEMBL
LigandPNGBDBM50400439(CHEMBL2177802)
Affinity DataIC50:  5.60E+4nM. Assay description: Inhibition of Bacillus anthracis Sterne 34F2 replicative DNA helicase-mediated ATP-dependent dissociation of Hel-5'FAM:Hel-3'BHQ by FRET assay
In DepthDetails ArticlePubMed