BDBM50401091 CHEMBL2204436::CHEMBL2385894
SMILES Clc1ccc(CN[C@H]2CCN(C2)c2ncc(Br)cn2)c(Cl)c1
InChI Key InChIKey=PXQNLQLMRMROSB-ZDUSSCGKSA-N
Data  6 IC50
  Tab Delimited (TSV)   2D SDfile   Computed 3D by Vconf -m prep SDfile
Find this compound or compounds like it in BindingDB:
Activity Spreadsheet -- Enzyme Inhibition Constant Data from BindingDB
Found 6 hits for monomerid = 50401091
TargetMetabotropic glutamate receptor 2(Homo sapiens (Human))
Vanderbilt University Medical Center
Curated by ChEMBL
LigandPNGBDBM50401091(CHEMBL2204436 | CHEMBL2385894)
Affinity DataIC50:  1.70E+4nM. Assay description: Negative allosteric modulation of human mGlu2 receptor assessed as Ca2+ flux by FLIPR assay
In DepthDetails ArticlePubMed
TargetMetabotropic glutamate receptor 3(Homo sapiens (Human))
Vanderbilt University Medical Center
Curated by ChEMBL
LigandPNGBDBM50401091(CHEMBL2204436 | CHEMBL2385894)
Affinity DataIC50:  4.20E+3nM. Assay description: Negative allosteric modulation of human mGlu3 receptor assessed as Ca2+ flux by FLIPR assay
In DepthDetails ArticlePubMed
TargetMetabotropic glutamate receptor 2(Homo sapiens (Human))
Vanderbilt University Medical Center
Curated by ChEMBL
LigandPNGBDBM50401091(CHEMBL2204436 | CHEMBL2385894)
Affinity DataIC50: >1.25E+4nM. Assay description: Negative allosteric modulation of human mGlu2 expressed in AV-12 cells in presence of glutamate EC90 concentration by FLIPR assay
In DepthDetails ArticlePubMed
TargetMetabotropic glutamate receptor 2(Homo sapiens (Human))
Vanderbilt University Medical Center
Curated by ChEMBL
LigandPNGBDBM50401091(CHEMBL2204436 | CHEMBL2385894)
Affinity DataIC50:  1.70E+4nM. Assay description: Negative allosteric modulation of mGlu2 assessed as thaillium flux through GIRK channels by cell-based assay
In DepthDetails ArticlePubMed
TargetMetabotropic glutamate receptor 3(Homo sapiens (Human))
Vanderbilt University Medical Center
Curated by ChEMBL
LigandPNGBDBM50401091(CHEMBL2204436 | CHEMBL2385894)
Affinity DataIC50:  190nM. Assay description: Negative allosteric modulation of human mGlu3 expressed in AV-12 cells in presence of glutamate EC90 concentration by FLIPR assay
In DepthDetails ArticlePubMed
TargetMetabotropic glutamate receptor 3(Homo sapiens (Human))
Vanderbilt University Medical Center
Curated by ChEMBL
LigandPNGBDBM50401091(CHEMBL2204436 | CHEMBL2385894)
Affinity DataIC50:  4.20E+3nM. Assay description: Negative allosteric modulation of mGlu3 assessed as thaillium flux through GIRK channels by cell-based assay
In DepthDetails ArticlePubMed