BDBM50401488 CHEMBL2204579
SMILES CC[C@H](NC)C(=O)N[C@H]1[C@@H](CNC(=O)CCCCc2cn(CCCCc3ccc(CCCCn4cc(CCCCC(=O)NC[C@H]5CC[C@H]6CC[C@H](N6C(=O)[C@H]5NC(=O)[C@H](CC)NC)C(=O)NC(c5ccccc5)c5ccccc5)nn4)cc3)nn2)CC[C@H]2CC[C@H](N2C1=O)C(=O)NC(c1ccccc1)c1ccccc1
InChI Key InChIKey=IUQSNYOPAPGETG-PRGBZCEMSA-N
Data  3 IC50
  Tab Delimited (TSV)   2D SDfile   Computed 3D by Vconf -m prep SDfile
Find this compound or compounds like it in BindingDB:
Activity Spreadsheet -- Enzyme Inhibition Constant Data from BindingDB
Found 3 hits for monomerid = 50401488
TargetE3 ubiquitin-protein ligase XIAP(Homo sapiens (Human))
Fondazione Irccs Istituto Nazionale Dei Tumori
Curated by ChEMBL
LigandPNGBDBM50401488(CHEMBL2204579)
Affinity DataIC50:  2.30nM. Assay description: Displacement of Smac-1F from human His-tagged XIAP linker BIR2-BIR3 linker (124 to 356 residues) after 3 hrs by fluorescent polarization assay
In DepthDetails ArticlePubMed
TargetBaculoviral IAP repeat-containing protein 2(Homo sapiens (Human))
Fondazione Irccs Istituto Nazionale Dei Tumori
Curated by ChEMBL
LigandPNGBDBM50401488(CHEMBL2204579)
Affinity DataIC50:  3.5nM. Assay description: Displacement of FITC-Smac from human recombinant His-tagged cIAP-1 BIR3 domain (245 to 357 residues) after 3 hrs by fluorescent polarization assay
In DepthDetails ArticlePubMed
TargetE3 ubiquitin-protein ligase XIAP(Homo sapiens (Human))
Fondazione Irccs Istituto Nazionale Dei Tumori
Curated by ChEMBL
LigandPNGBDBM50401488(CHEMBL2204579)
Affinity DataIC50:  157nM. Assay description: Displacement of FITC-Smac from human His-tagged XIAP BIR3 domain (241 to 356 residues) after 3 hrs by fluorescent polarization assay
In DepthDetails ArticlePubMed