BDBM50402258 CHEMBL2204784
SMILES CC(=O)Nc1nc(C)c(s1)-c1cnc(Oc2cccnc2)o1
InChI Key InChIKey=RLCMKGIYRDAFFS-UHFFFAOYSA-N
Data  2 IC50
  Tab Delimited (TSV)   2D SDfile   Computed 3D by Vconf -m prep SDfile
Find this compound or compounds like it in BindingDB:
Activity Spreadsheet -- Enzyme Inhibition Constant Data from BindingDB
Found 2 hits for monomerid = 50402258
TargetPhosphatidylinositol 4,5-bisphosphate 3-kinase catalytic subunit gamma isoform(Mus musculus (Mouse))
Taisho Pharmaceutical
Curated by ChEMBL
LigandPNGBDBM50402258(CHEMBL2204784)
Affinity DataIC50:  1.67E+3nM. Assay description: Inhibition of PI3Kgamma in mouse RAW264.7 cells assessed as inhibition of C5a-induced PKB/Akt phosphorylation incubated for 30 mins prior to C5a-indu...
In DepthDetails ArticlePubMed
TargetPhosphatidylinositol 4,5-bisphosphate 3-kinase catalytic subunit gamma isoform(Homo sapiens (Human))
Taisho Pharmaceutical
Curated by ChEMBL
LigandPNGBDBM50402258(CHEMBL2204784)
Affinity DataIC50:  117nM. Assay description: Inhibition of human PI3Kgamma using phosphatidylinositol as substrate and [33gammaP]ATP after 2 hrs by scintillation counting
In DepthDetails ArticlePubMed