BDBM50402268 CHEMBL2204794
SMILES CC(=O)Nc1nc(C)c(s1)-c1cnc(o1)N1CCCC(O)C1
InChI Key InChIKey=HDVSIMMLUNLLCM-UHFFFAOYSA-N
Data  2 IC50
  Tab Delimited (TSV)   2D SDfile   Computed 3D by Vconf -m prep SDfile
Find this compound or compounds like it in BindingDB:
Activity Spreadsheet -- Enzyme Inhibition Constant Data from BindingDB
Found 2 hits for monomerid = 50402268
TargetPhosphatidylinositol 4,5-bisphosphate 3-kinase catalytic subunit gamma isoform(Homo sapiens (Human))
Taisho Pharmaceutical
Curated by ChEMBL
LigandPNGBDBM50402268(CHEMBL2204794)
Affinity DataIC50:  14nM. Assay description: Inhibition of human PI3Kgamma using phosphatidylinositol as substrate and [33gammaP]ATP after 2 hrs by scintillation counting
In DepthDetails ArticlePubMed
TargetPhosphatidylinositol 4,5-bisphosphate 3-kinase catalytic subunit gamma isoform(Mus musculus (Mouse))
Taisho Pharmaceutical
Curated by ChEMBL
LigandPNGBDBM50402268(CHEMBL2204794)
Affinity DataIC50:  237nM. Assay description: Inhibition of PI3Kgamma in mouse RAW264.7 cells assessed as inhibition of C5a-induced PKB/Akt phosphorylation incubated for 30 mins prior to C5a-indu...
In DepthDetails ArticlePubMed