BDBM50402331 CHEMBL2206092
SMILES COc1ccc(CCSc2nc3n(C)c(=O)n(C)c(=O)c3n2C)cc1
InChI Key InChIKey=VWUGZHNYYIMLGZ-UHFFFAOYSA-N
Data  2 IC50
  Tab Delimited (TSV)   2D SDfile   Computed 3D by Vconf -m prep SDfile
Find this compound or compounds like it in BindingDB:
Activity Spreadsheet -- Enzyme Inhibition Constant Data from BindingDB
Found 2 hits for monomerid = 50402331
TargetAmine oxidase [flavin-containing] A(Homo sapiens (Human))
North-West University
Curated by ChEMBL
LigandPNGBDBM50402331(CHEMBL2206092)
Affinity DataIC50:  1.68E+5nM. Assay description: Inhibition of human recombinant MAO-A expressed in insect cell microsome assessed as 4-hydroxyquinoline formation using kynuramine as substrate after...
In DepthDetails ArticlePubMed
TargetAmine oxidase [flavin-containing] B(Homo sapiens (Human))
North-West University
Curated by ChEMBL
LigandPNGBDBM50402331(CHEMBL2206092)
Affinity DataIC50:  23nM. Assay description: Inhibition of human recombinant MAO-B expressed in insect cell microsome assessed as 4-hydroxyquinoline formation using kynuramine as substrate after...
In DepthDetails ArticlePubMed