BDBM50402335 CHEMBL2206108
SMILES Cn1c(SCCc2ccc(Br)cc2)nc2n(C)c(=O)n(C)c(=O)c12
InChI Key InChIKey=QLVOAICPMUYEEH-UHFFFAOYSA-N
Data  2 IC50
  Tab Delimited (TSV)   2D SDfile   Computed 3D by Vconf -m prep SDfile
Find this compound or compounds like it in BindingDB:
Activity Spreadsheet -- Enzyme Inhibition Constant Data from BindingDB
Found 2 hits for monomerid = 50402335
TargetAmine oxidase [flavin-containing] A(Homo sapiens (Human))
North-West University
Curated by ChEMBL
LigandPNGBDBM50402335(CHEMBL2206108)
Affinity DataIC50:  1.08E+5nM. Assay description: Inhibition of human recombinant MAO-A expressed in insect cell microsome assessed as 4-hydroxyquinoline formation using kynuramine as substrate after...
In DepthDetails ArticlePubMed
TargetAmine oxidase [flavin-containing] B(Homo sapiens (Human))
North-West University
Curated by ChEMBL
LigandPNGBDBM50402335(CHEMBL2206108)
Affinity DataIC50:  19nM. Assay description: Inhibition of human recombinant MAO-B expressed in insect cell microsome assessed as 4-hydroxyquinoline formation using kynuramine as substrate after...
In DepthDetails ArticlePubMed